[style] checkpatch.

5 jobs for <span class="ref-name">remove-static-allocs</span> in 6 minutes and 24 seconds
Status Job ID Name Coverage
  Style
passed #43101
integration
checkpatch

00:00:33

passed #43100
integration
repoquality

00:02:21

 
  Build
failed #43102
make:generic

00:01:15

failed #43104
knl
make:knl

00:01:33

failed #43103
make:out-of-tree

00:01:14

 
Name Stage Failure
failed
make:knl Build
compilation aborted for dgemm_prefetch.c (code 2)
make[1]: *** [dgemm_prefetch.o] Error 2
make[1]: Leaving directory `/home/gitlab-runner/builds/259091ff/0/argo/aml/benchmarks'
make: *** [all-recursive] Error 1
Uploading artifacts...
config.log: found 1 matching files
WARNING: tests/*.log: no matching files
Uploading artifacts to coordinator... ok id=43104 responseStatus=201 Created token=sX5sJbKH
ERROR: Job failed: exit status 1
failed
make:out-of-tree Build
cc1: all warnings being treated as errors
make[1]: *** [tiling/tiling_1d.lo] Error 1
make[1]: Leaving directory `/home/gitlab-runner/builds/259091ff/0/argo/aml/out/src'
make: *** [all-recursive] Error 1
Uploading artifacts...
WARNING: config.log: no matching files
WARNING: tests/*.log: no matching files
ERROR: No files to upload
ERROR: Job failed: exit status 1
failed
make:generic Build
cc1: all warnings being treated as errors
make[1]: *** [tiling/tiling_1d.lo] Error 1
make[1]: Leaving directory `/home/gitlab-runner/builds/259091ff/0/argo/aml/src'
make: *** [all-recursive] Error 1
Uploading artifacts...
config.log: found 1 matching files
WARNING: tests/*.log: no matching files
Uploading artifacts to coordinator... ok id=43102 responseStatus=201 Created token=ZyLGMtwh
ERROR: Job failed: exit status 1