[ci] Reverts doxygen to 1.8.14.

8 jobs for shell-pin-pkgs in 6 minutes and 13 seconds (queued for 2 seconds)
Status Job ID Name Coverage
  Style
passed #76425
nix kvm
clang-format

00:01:26

passed #76424
nix kvm
repoquality

00:00:02

passed #76426
nix kvm
style:docs

00:02:17

 
  Build
passed #76431
cuda
make:chimera

00:00:53

failed #76427
nix kvm
make:generic

00:02:16

passed #76430
knl
make:knl

00:03:53

failed #76428
nix kvm
make:out-of-tree

00:00:41

failed #76429
nix kvm
make:valgrind

00:00:43

 
Name Stage Failure
failed
make:valgrind Build
make[1]: *** [Makefile:1073: check-valgrind-am] Error 2
make[1]: Leaving directory '/var/lib/gitlab-runner/builds/DaXnf6_G/0/argo/aml/src'
make: *** [Makefile:494: check-valgrind-recursive] Error 1
Uploading artifacts...
Runtime platform arch=amd64 os=linux pid=5826 revision=v12.4.1 version=12.4.1
config.log: found 1 matching files

WARNING: tests/*.log: no matching files
Uploading artifacts to coordinator... ok
id=76429 responseStatus=201 Created token=RjC5FWmo
ERROR: Job failed: exit status 1
failed
make:generic Build
make[1]: *** [Makefile:697: area/hwloc.lo] Error 1
make[1]: Leaving directory '/var/lib/gitlab-runner/builds/1dArrp3p/0/argo/aml/src'
make: *** [Makefile:494: install-recursive] Error 1
Uploading artifacts...
Runtime platform arch=amd64 os=linux pid=894 revision=v12.4.1 version=12.4.1
config.log: found 1 matching files

WARNING: tests/*.log: no matching files
Uploading artifacts to coordinator... ok
id=76427 responseStatus=201 Created token=DxRSrAVE
ERROR: Job failed: exit status 1
failed
make:out-of-tree Build
make[1]: *** [Makefile:697: area/hwloc.lo] Error 1
make[1]: Leaving directory '/var/lib/gitlab-runner/builds/U41ky22b/0/argo/aml/out/src'
make: *** [Makefile:494: check-recursive] Error 1
Uploading artifacts...
Runtime platform arch=amd64 os=linux pid=13719 revision=v12.4.1 version=12.4.1
WARNING: config.log: no matching files
WARNING: tests/*.log: no matching files
ERROR: No files to upload
ERROR: Job failed: exit status 1